Target
5-hydroxytryptamine receptor 6
Ligand
BDBM50034802
Substrate
Meas. Tech.
ChEMBL_1441768 (CHEMBL3378891)
Ki
9141±n/a nM
Citation
 Partyka, AChlon-Rzepa, GWasik, AJastrzebska-Wiesek, MBucki, AKolaczkowski, MSatala, GBojarski, AJWesolowska, A Antidepressant- and anxiolytic-like activity of 7-phenylpiperazinylalkyl-1,3-dimethyl-purine-2,6-dione derivatives with diversified 5-HT1A receptor functional profile. Bioorg Med Chem 23:212-21 (2014)  
Target
Name:
5-hydroxytryptamine receptor 6
Synonyms:
5-HT-6 5-hydroxytryptamine receptor 6 (5-HT-6) 5-hydroxytryptamine receptor 6 (5HT6) HTR6 Serotonin 6 (5-HT6) receptor | Serotonin Receptor 6
Type:
G Protein-Coupled Receptor (GPCR)
Mol. Mass.:
46968.43
Organism:
Homo sapiens (Human)
Description:
P50406
Residue:
440
  
Inhibitor
Name:
BDBM50034802
Synonyms:
CHEMBL3361004
Type:
Small organic molecule
Emp. Form.:
C21H28ClN5O2
Mol. Mass.:
417.932
SMILES:
Cl.Cn1c2ncn(CCCCCN3CCc4ccccc4C3)c2c(=O)n(C)c1=O
: