Target
Androgen receptor
Ligand
BDBM50035571
Substrate
Meas. Tech.
ChEMBL_1432809 (CHEMBL3382073)
IC50
83800±n/a nM
Citation
 González, MA Synthetic derivatives of aromatic abietane diterpenoids and their biological activities. Eur J Med Chem 87:834-42 (2014)  
Target
Name:
Androgen receptor
Synonyms:
ANDR_HUMAN Androgen Receptor Androgen receptor/Baculoviral IAP repeat-containing protein 2 Dihydrotestosterone receptor Nuclear receptor subfamily 3 group C member 4
Type:
Receptor
Mol. Mass.:
99185.27
Organism:
Homo sapiens (Human)
Description:
CHO cells were stably transfected with human AR gene.
Residue:
920
  
Inhibitor
Name:
BDBM50035571
Synonyms:
CHEMBL3343778
Type:
Small organic molecule
Emp. Form.:
C27H33NO2
Mol. Mass.:
403.5564
SMILES:
[H][C@@]12CC(=O)c3cc(ccc3[C@@]1(C)CCC[C@@]2(C)CNC(=O)c1ccccc1)C(C)C
: