Target
Cystic fibrosis transmembrane conductance regulator
Ligand
BDBM50035583
Substrate
Meas. Tech.
ChEMBL_1432831 (CHEMBL3382095)
EC50
3.0±n/a nM
Citation
 Hadida, SVan Goor, FZhou, JArumugam, VMcCartney, JHazlewood, ADecker, CNegulescu, PGrootenhuis, PD Discovery of N-(2,4-di-tert-butyl-5-hydroxyphenyl)-4-oxo-1,4-dihydroquinoline-3-carboxamide (VX-770, ivacaftor), a potent and orally bioavailable CFTR potentiator. J Med Chem 57:9776-95 (2014)  
Target
Name:
Cystic fibrosis transmembrane conductance regulator
Synonyms:
ABCC7 CFTR Channel conductance-controlling ATPase | cAMP-dependent chloride channel
Type:
Enzyme Catalytic Domain
Mol. Mass.:
168171.30
Organism:
Homo sapiens (Human)
Description:
gi_90421313
Residue:
1480
  
Inhibitor
Name:
BDBM50035583
Synonyms:
CHEMBL3357143
Type:
Small organic molecule
Emp. Form.:
C21H19F3N2O3
Mol. Mass.:
404.3824
SMILES:
CC(C)(C)c1cc(c(NC(=O)c2c[nH]c3ccccc3c2=O)cc1O)C(F)(F)F
: