Target
Prostaglandin G/H synthase 2
Ligand
BDBM50029593
Substrate
Meas. Tech.
ChEMBL_1438760 (CHEMBL3389155)
IC50
1800±n/a nM
Citation
 Kang, SMLee, JJin, JHKim, MLee, SLee, HHShin, JSLee, KTLee, JY Synthesis and PGE2 production inhibition of s-triazine derivatives as a novel scaffold in RAW 264.7 macrophage cells. Bioorg Med Chem Lett 24:5418-22 (2015)  
Target
Name:
Prostaglandin G/H synthase 2
Synonyms:
COX2 Cyclooxygenase 2 (COX-2) Cyclooxygenase-2 (COX-2 AA) Cyclooxygenase-2 (COX-2) PGH2_HUMAN PHS II Prostaglandin E synthase/G/H synthase 2 Prostaglandin-endoperoxide synthase 2
Type:
Enzyme
Mol. Mass.:
69003.89
Organism:
Homo sapiens (Human)
Description:
Recombinant Cox-2 provided by Cayman (Cayman Chemical Co.,Ann Arbor, MI).
Residue:
604
  
Inhibitor
Name:
BDBM50029593
Synonyms:
CHEMBL7162 N-(2-Cyclohexyloxy-4-nitro-phenyl)-methanesulfonamide N-[2-(cyclohexyloxy)-4-nitrophenyl]methane sulfonamide N-{2-(cyclohexyloxy)-4-[hydroxy(oxido)amino]phenyl}methanesulfonamide NS398
Type:
Small organic molecule
Emp. Form.:
C13H18N2O5S
Mol. Mass.:
314.357
SMILES:
CS(=O)(=O)Nc1ccc(cc1OC1CCCCC1)[N+]([O-])=O
: