Target
Equilibrative nucleoside transporter 1
Ligand
BDBM50036307
Substrate
Meas. Tech.
ChEMBL_1432010 (CHEMBL3388115)
IC50
2.8±n/a nM
Citation
 Playa, HLewis, TATing, ASuh, BCMuņoz, BMatuza, RPasser, BJSchreiber, SLBuolamwini, JK Dilazep analogues for the study of equilibrative nucleoside transporters 1 and 2 (ENT1 and ENT2). Bioorg Med Chem Lett 24:5801-4 (2014)  
Target
Name:
Equilibrative nucleoside transporter 1
Synonyms:
ENT1 Equilibrative Nucleoside Transporter 1 (ENT1) Equilibrative nucleoside transporter 1 S29A1_HUMAN Solute carrier family 29 member 1
Type:
Multi-pass membrane protein
Mol. Mass.:
50225.92
Organism:
Homo sapiens (Human)
Description:
Residue:
456
  
Inhibitor
Name:
BDBM50036307
Synonyms:
CHEMBL3353069
Type:
Small organic molecule
Emp. Form.:
C28H38N2O10
Mol. Mass.:
562.6087
SMILES:
COc1cc(cc(OC)c1OC)C(=O)OCCN1CCN(CCOC(=O)c2cc(OC)c(OC)c(OC)c2)CC1
: