Target
Acid ceramidase
Ligand
BDBM50392472
Substrate
Meas. Tech.
ChEMBL_1435908 (CHEMBL3381632)
IC50
27700±n/a nM
Citation
 Bai, ASzulc, ZMBielawski, JPierce, JSRembiesa, BTerzieva, SMao, CXu, RWu, BClarke, CJNewcomb, BLiu, XNorris, JHannun, YABielawska, A Targeting (cellular) lysosomal acid ceramidase by B13: design, synthesis and evaluation of novel DMG-B13 ester prodrugs. Bioorg Med Chem 22:6933-44 (2014)  
Target
Name:
Acid ceramidase
Synonyms:
ASAH ASAH1_HUMAN Acid ceramidase (AC)
Type:
Enzyme
Mol. Mass.:
44662.65
Organism:
Homo sapiens (Human)
Description:
Q13510
Residue:
395
  
Inhibitor
Name:
BDBM50392472
Synonyms:
CHEMBL408217
Type:
Small organic molecule
Emp. Form.:
C23H38N2O5
Mol. Mass.:
422.5582
SMILES:
CCCCCCCCCCCCCC(=O)N[C@H](CO)[C@H](O)c1ccc(cc1)[N+]([O-])=O
: