Target
Glutamate receptor ionotropic, NMDA 2B
Ligand
BDBM50037709
Substrate
Meas. Tech.
ChEMBL_1438829 (CHEMBL3390297)
Ki
10.0±n/a nM
Citation
 Gawaskar, SSchepmann, DBonifazi, AWünsch, B Synthesis, GluN2B affinity and selectivity of benzo[7]annulen-7-amines. Bioorg Med Chem 22:6638-46 (2015)  
Target
Name:
Glutamate receptor ionotropic, NMDA 2B
Synonyms:
GRIN2B Glutamate [NMDA] receptor subunit epsilon 2 N-methyl D-aspartate receptor subtype 2B NMDAR2B NR3 | hNR3
Type:
PROTEIN
Mol. Mass.:
166375.46
Organism:
Homo sapiens (Human)
Description:
ChEMBL_1438829
Residue:
1484
  
Inhibitor
Name:
BDBM50037709
Synonyms:
CHEMBL3357784
Type:
Small organic molecule
Emp. Form.:
C21H27NO
Mol. Mass.:
309.4452
SMILES:
COc1ccc2CCC(CCc2c1)NCCCc1ccccc1
: