Target
Glutamate receptor ionotropic, NMDA 2B
Ligand
BDBM50079387
Substrate
Meas. Tech.
ChEMBL_1438829 (CHEMBL3390297)
Ki
13±n/a nM
Citation
 Gawaskar, SSchepmann, DBonifazi, AWünsch, B Synthesis, GluN2B affinity and selectivity of benzo[7]annulen-7-amines. Bioorg Med Chem 22:6638-46 (2015)  
Target
Name:
Glutamate receptor ionotropic, NMDA 2B
Synonyms:
GRIN2B Glutamate [NMDA] receptor subunit epsilon 2 N-methyl D-aspartate receptor subtype 2B NMDAR2B NR3 | hNR3
Type:
PROTEIN
Mol. Mass.:
166375.46
Organism:
Homo sapiens (Human)
Description:
ChEMBL_1438829
Residue:
1484
  
Inhibitor
Name:
BDBM50079387
Synonyms:
1-(4-Chloro-phenyl)-2-[4-(4-fluoro-benzyl)-piperidin-1-yl]-ethanol Eliprodil
Type:
Small organic molecule
Emp. Form.:
C20H23ClFNO
Mol. Mass.:
347.854
SMILES:
OC(CN1CCC(Cc2ccc(F)cc2)CC1)c1ccc(Cl)cc1
: