Target
Aromatase
Ligand
BDBM50028166
Substrate
Meas. Tech.
ChEMBL_1440359 (CHEMBL3385621)
IC50
15±n/a nM
Citation
 Stefanachi, AHanke, NPisani, LLeonetti, FNicolotti, OCatto, MCellamare, SHartmann, RWCarotti, A Discovery of new 7-substituted-4-imidazolylmethyl coumarins and 4'-substituted-2-imidazolyl acetophenones open analogues as potent and selective inhibitors of steroid-11ß-hydroxylase. Eur J Med Chem 89:106-14 (2014)  
Target
Name:
Aromatase
Synonyms:
ARO1 CP19A_HUMAN CYP19 CYPXIX Cytochrome P450 19A1 Cytochrome P450-C19 (CYP19) FL cytokine receptor precursor | P-450AROM
Type:
Enzyme
Mol. Mass.:
57888.92
Organism:
Homo sapiens (Human)
Description:
P11511
Residue:
503
  
Inhibitor
Name:
BDBM50028166
Synonyms:
CHEMBL934 US9138393, Metyrapone US9394290, MTP (metyrapone)
Type:
Small organic molecule
Emp. Form.:
C14H14N2O
Mol. Mass.:
226.2738
SMILES:
CC(C)(C(=O)c1cccnc1)c1cccnc1
: