Target
Sigma non-opioid intracellular receptor 1
Ligand
BDBM50038366
Substrate
Meas. Tech.
ChEMBL_1441163 (CHEMBL3378827)
Ki
2.5±n/a nM
Citation
 Donnier-Maréchal, MLarchanché, PELe Broc, DFurman, CCarato, PMelnyk, P Carboline- and phenothiazine-derivated heterocycles as potent SIGMA-1 protein ligands. Eur J Med Chem 89:198-206 (2014)  
Target
Name:
Sigma non-opioid intracellular receptor 1
Synonyms:
Aging-associated gene 8 protein SGMR1_HUMAN SIGMAR1 SR31747-binding protein Sigma 1-type opioid receptor Sigma1R | hSigmaR1
Type:
Enzyme Catalytic Domain
Mol. Mass.:
25124.85
Organism:
Homo sapiens (Human)
Description:
Q99720
Residue:
223
  
Inhibitor
Name:
BDBM50038366
Synonyms:
CHEMBL3360564
Type:
Small organic molecule
Emp. Form.:
C23H28N2O
Mol. Mass.:
348.4812
SMILES:
CN(CCCN1CCc2oc3ccccc3c2C1)CCc1ccccc1
: