Target
Aurora kinase C
Ligand
BDBM50038423
Substrate
Meas. Tech.
ChEMBL_1441962 (CHEMBL3372228)
IC50
4750±n/a nM
Citation
 Xie, FZhu, HZhang, HLang, QTang, LHuang, QYu, L In vitro and in vivo characterization of a benzofuran derivative, a potential anticancer agent, as a novel Aurora B kinase inhibitor. Eur J Med Chem 89:310-9 (2014)  
Target
Name:
Aurora kinase C
Synonyms:
AIE2 AIRK3 AURKC Aurora Kinase C (Aurora-C) Aurora kinase C (AURKC) Aurora-C/INCENP Aurora/Ipl1/Eg2 protein 2 Serine/threonine-protein kinase 13 | Serine/threonine-protein kinase Aurora-C
Type:
Enzyme
Mol. Mass.:
35602.43
Organism:
Homo sapiens (Human)
Description:
Amino acid residues 1-309 were expressed as His-tagged fusion protein using baculovirus expression system.
Residue:
309
  
Inhibitor
Name:
BDBM50038423
Synonyms:
CHEMBL3361128
Type:
Small organic molecule
Emp. Form.:
C15H10O4
Mol. Mass.:
254.2375
SMILES:
Oc1ccc(\C=C2\Oc3ccccc3C2=O)cc1O
: