Target
Inosine-5'-monophosphate dehydrogenase
Ligand
BDBM50040491
Substrate
Meas. Tech.
ChEMBL_1443968 (CHEMBL3375356)
IC50
1500±n/a nM
Citation
 Sun, ZKhan, JMakowska-Grzyska, MZhang, MCho, JHSuebsuwong, CVo, PGollapalli, DRKim, YJoachimiak, AHedstrom, LCuny, GD Synthesis, in vitro evaluation and cocrystal structure of 4-oxo-[1]benzopyrano[4,3-c]pyrazole Cryptosporidium parvum inosine 5'-monophosphate dehydrogenase (CpIMPDH) inhibitors. J Med Chem 57:10544-50 (2014)  
Target
Name:
Inosine-5'-monophosphate dehydrogenase
Synonyms:
Cgd6_20 protein Inosine-5'-monophosphate dehydrogenase, probable | Inosine-5-monophosphate dehydrogenase (IMPDH)
Type:
Protein
Mol. Mass.:
43076.80
Organism:
Cryptosporidium parvum
Description:
Q8T6T2
Residue:
400
  
Inhibitor
Name:
BDBM50040491
Synonyms:
CHEMBL3360622
Type:
Small organic molecule
Emp. Form.:
C19H15N3O4
Mol. Mass.:
349.3401
SMILES:
COc1cccc(NC(=O)Cn2ncc3c2c2ccccc2oc3=O)c1
: