Target
Transitional endoplasmic reticulum ATPase
Ligand
BDBM50040551
Substrate
Meas. Tech.
ChEMBL_1443970 (CHEMBL3375358)
IC50
27±n/a nM
Citation
 Cervi, GMagnaghi, PAsa, DAvanzi, NBadari, ABorghi, DCaruso, MCirla, ACozzi, LFelder, EGalvani, AGasparri, FLomolino, AMagnuson, SMalgesini, BMotto, IPasi, MRizzi, SSalom, BSorrentino, GTroiani, SValsasina, BO'Brien, TIsacchi, ADonati, DD'Alessio, R Discovery of 2-(cyclohexylmethylamino)pyrimidines as a new class of reversible valosine containing protein inhibitors. J Med Chem 57:10443-54 (2014)  
Target
Name:
Transitional endoplasmic reticulum ATPase
Synonyms:
TERA_HUMAN VCP Valosin-containing protein
Type:
Enzyme
Mol. Mass.:
89300.63
Organism:
Homo sapiens (Human)
Description:
P55072
Residue:
806
  
Inhibitor
Name:
BDBM50040551
Synonyms:
CHEMBL3361184
Type:
Small organic molecule
Emp. Form.:
C25H28N4O2
Mol. Mass.:
416.5154
SMILES:
OC(=O)[C@H]1CC[C@H](CNc2nc(NCc3ccccc3)cc(n2)-c2ccccc2)CC1
: