Target
Interleukin-1 receptor-associated kinase 4
Ligand
BDBM50040806
Substrate
Meas. Tech.
ChEMBL_1444239 (CHEMBL3380178)
Ki
7.5±n/a nM
Citation
 Chaudhary, DRobinson, SRomero, DL Recent advances in the discovery of small molecule inhibitors of interleukin-1 receptor-associated kinase 4 (IRAK4) as a therapeutic target for inflammation and oncology disorders. J Med Chem 58:96-110 (2015)  
Target
Name:
Interleukin-1 receptor-associated kinase 4
Synonyms:
IRAK-4 IRAK4_HUMAN Interleukin-1 receptor-associated kinase 4 (IRAK4) | Renal carcinoma antigen NY-REN-64
Type:
Protein
Mol. Mass.:
51519.08
Organism:
Homo sapiens (Human)
Description:
Q9NWZ3
Residue:
460
  
Inhibitor
Name:
BDBM50040806
Synonyms:
CHEMBL3361254
Type:
Small organic molecule
Emp. Form.:
C21H28N4O3S
Mol. Mass.:
416.537
SMILES:
NC(=O)C[C@H]1CCc2sc3ncnc(O[C@H]4CC[C@@H](CC4)N4CCOCC4)c3c12
: