Target
Cannabinoid receptor 2
Ligand
BDBM50040976
Substrate
Meas. Tech.
ChEMBL_1444762 (CHEMBL3378463)
EC50
7.4±n/a nM
Citation
 Han, SThoresen, LZhu, XNarayanan, SJung, JKStrah-Pleynet, SDecaire, MChoi, KXiong, YYue, DSemple, GThatte, JSolomon, MFu, LWhelan, KAl-Shamma, HGatlin, JChen, RDang, HPride, CGaidarov, IUnett, DJBehan, DPSadeque, AUsmani, KAChen, CEdwards, JMorgan, MJones, RM Discovery of 1a,2,5,5a-tetrahydro-1H-2,3-diaza-cyclopropa[a]pentalen-4-carboxamides as potent and selective CB2 receptor agonists. Bioorg Med Chem Lett 25:322-6 (2014)  
Target
Name:
Cannabinoid receptor 2
Synonyms:
CANNABINOID CB2 CB2 CB2B CNR2_HUMAN Cannabinoid CB2 receptor Cannabinoid receptor 2 (CB2R) | hCB2
Type:
G Protein-Coupled Receptor (GPCR)
Mol. Mass.:
39690.94
Organism:
Homo sapiens (Human)
Description:
P34972
Residue:
360
  
Inhibitor
Name:
BDBM50040976
Synonyms:
CHEMBL3354969
Type:
Small organic molecule
Emp. Form.:
C18H20FN3O2
Mol. Mass.:
329.3687
SMILES:
[H][C@]12C[C@@]1([H])c1c(C2)c(nn1-c1cccc(F)c1)C(=O)NC(C)(C)CO
: