Target
Cannabinoid receptor 1
Ligand
BDBM50040973
Substrate
Meas. Tech.
ChEMBL_1444771 (CHEMBL3378472)
EC50
>30000±n/a nM
Citation
 Han, SThoresen, LZhu, XNarayanan, SJung, JKStrah-Pleynet, SDecaire, MChoi, KXiong, YYue, DSemple, GThatte, JSolomon, MFu, LWhelan, KAl-Shamma, HGatlin, JChen, RDang, HPride, CGaidarov, IUnett, DJBehan, DPSadeque, AUsmani, KAChen, CEdwards, JMorgan, MJones, RM Discovery of 1a,2,5,5a-tetrahydro-1H-2,3-diaza-cyclopropa[a]pentalen-4-carboxamides as potent and selective CB2 receptor agonists. Bioorg Med Chem Lett 25:322-6 (2014)  
Target
Name:
Cannabinoid receptor 1
Synonyms:
Brain-type cannabinoid receptor CB-R CNR1_RAT Cannabinoid receptor Cnr1 | Skr6
Type:
G Protein-Coupled Receptor (GPCR)
Mol. Mass.:
52856.55
Organism:
Rattus norvegicus (rat)
Description:
P20272
Residue:
473
  
Inhibitor
Name:
BDBM50040973
Synonyms:
CHEMBL3354972
Type:
Small organic molecule
Emp. Form.:
C18H19F2N3O2
Mol. Mass.:
347.3592
SMILES:
[H][C@]12C[C@@]1([H])c1c(C2)c(nn1-c1c(F)cccc1F)C(=O)NC(C)(C)CO
: