Target
Sphingosine 1-phosphate receptor 1
Ligand
BDBM50041812
Substrate
Meas. Tech.
ChEMBL_1446103 (CHEMBL3380330)
EC50
26±n/a nM
Citation
 Buzard, DJKim, SHLopez, LKawasaki, AZhu, XMoody, JThoresen, LCalderon, IUllman, BHan, SLehmann, JGharbaoui, TSengupta, DCalvano, LMontalban, AGMa, YASage, CGao, YSemple, GEdwards, JBarden, JMorgan, MChen, WUsmani, KChen, CSadeque, AChristopher, RJThatte, JFu, LSolomon, MMills, DWhelan, KAl-Shamma, HGatlin, JLe, MGaidarov, IAnthony, TUnett, DJBlackburn, ARueter, JStirn, SBehan, DPJones, RM Discovery of APD334: Design of a Clinical Stage Functional Antagonist of the Sphingosine-1-phosphate-1 Receptor. ACS Med Chem Lett 5:1313-7 (2014)  
Target
Name:
Sphingosine 1-phosphate receptor 1
Synonyms:
CHEDG1 Endothelial differentiation G-protein coupled receptor 1 S1P1 S1PR1_HUMAN Sphingosine 1-phosphate receptor Edg-1
Type:
Enzyme
Mol. Mass.:
42836.02
Organism:
Homo sapiens (Human)
Description:
P21453
Residue:
382
  
Inhibitor
Name:
BDBM50041812
Synonyms:
CHEMBL3358905
Type:
Small organic molecule
Emp. Form.:
C22H17F6NO3
Mol. Mass.:
457.3657
SMILES:
OC(=O)CC1CCc2c1[nH]c1ccc(OCc3cc(cc(c3)C(F)(F)F)C(F)(F)F)cc21
: