Target
High affinity cAMP-specific 3',5'-cyclic phosphodiesterase 7A
Ligand
BDBM50032540
Substrate
Meas. Tech.
ChEMBL_1443874 (CHEMBL3374135)
IC50
2.0±n/a nM
Citation
 Endo, YKawai, KAsano, TAmano, SAsanuma, YSawada, KOgura, KNagata, NUeo, NTakahashi, NSonoda, YKamei, N Discovery and SAR study of 2-(4-pyridylamino)thieno[3,2-d]pyrimidin-4(3H)-ones as soluble and highly potent PDE7 inhibitors. Bioorg Med Chem Lett 25:649-53 (2015)  
Target
Name:
High affinity cAMP-specific 3',5'-cyclic phosphodiesterase 7A
Synonyms:
3',5'-cyclic phosphodiesterase PDE7A_HUMAN Phosphodiesterase 7 (PDE7) Phosphodiesterase 7A (PDE7A1)
Type:
Enzyme
Mol. Mass.:
55514.96
Organism:
Homo sapiens (Human)
Description:
Q13946
Residue:
482
  
Inhibitor
Name:
BDBM50032540
Synonyms:
CHEMBL3354179
Type:
Small organic molecule
Emp. Form.:
C18H20N4OS
Mol. Mass.:
340.443
SMILES:
CCn1c(NC2CCCC2)nc2c(csc2c1=O)-c1cccnc1
: