Target
Cannabinoid receptor 1
Ligand
BDBM50042595
Substrate
Meas. Tech.
ChEMBL_1444457 (CHEMBL3373565)
EC50
970±n/a nM
Citation
 Riether, DZindell, RWu, LBetageri, RJenkins, JEKhor, SBerry, AKHickey, ERErmann, MAlbrecht, CCeci, AGemkow, MJNagaraja, NVRomig, HSauer, AThomson, DS Selective CB2 receptor agonists. Part 2: Structure-activity relationship studies and optimization of proline-based compounds. Bioorg Med Chem Lett 25:581-6 (2015)  
Target
Name:
Cannabinoid receptor 1
Synonyms:
CANN6 CB-R CNR CNR1_HUMAN Cannabinoid receptor Cannabinoid receptor 1 (brain)
Type:
G Protein-Coupled Receptor (GPCR)
Mol. Mass.:
52868.96
Organism:
Homo sapiens (Human)
Description:
P21554
Residue:
472
  
Inhibitor
Name:
BDBM50042595
Synonyms:
CHEMBL3353888
Type:
Small organic molecule
Emp. Form.:
C19H20F3N3O4
Mol. Mass.:
411.375
SMILES:
CC(C)(CO)c1cc(NC(=O)[C@@H]2CCC(=O)N2c2ccc(cc2)C(F)(F)F)on1
: