Target
Cannabinoid receptor 2
Ligand
BDBM50042886
Substrate
Meas. Tech.
ChEMBL_1444651 (CHEMBL3376649)
EC50
41±n/a nM
Citation
 Bartolozzi, ACirillo, PFBerry, AKHickey, ERThomson, DSWu, LZindell, RAlbrecht, CCeci, AGemkow, MJNagaraja, NVRomig, HSauer, ARiether, D Selective CB2 receptor agonists. Part 3: the optimization of a piperidine-based series that demonstrated efficacy in an in vivo neuropathic pain model. Bioorg Med Chem Lett 25:587-92 (2015)  
Target
Name:
Cannabinoid receptor 2
Synonyms:
CANNABINOID CB2 CB2 CB2B CNR2_HUMAN Cannabinoid CB2 receptor Cannabinoid receptor 2 (CB2R) | hCB2
Type:
G Protein-Coupled Receptor (GPCR)
Mol. Mass.:
39690.94
Organism:
Homo sapiens (Human)
Description:
P34972
Residue:
360
  
Inhibitor
Name:
BDBM50042886
Synonyms:
CHEMBL3354542
Type:
Small organic molecule
Emp. Form.:
C20H31N3O4
Mol. Mass.:
377.4778
SMILES:
CC(C)(C)c1cc(NC(=O)[C@@H]2CCCCN2C(=O)[C@H]2CC[C@H](O)CC2)no1
: