Target
Serine/threonine-protein kinase PAK 4
Ligand
BDBM50448771
Substrate
Meas. Tech.
ChEMBL_1444805 (CHEMBL3379048)
IC50
4.8±n/a nM
Citation
 Abdel-Magid, AF P21-Activated Kinase 4 (PAK4) Inhibitors as Potential Cancer Therapy. ACS Med Chem Lett 6:17-8 (2015)  
Target
Name:
Serine/threonine-protein kinase PAK 4
Synonyms:
KIAA1142 PAK4_HUMAN | p21-Activated kinase 4 (PAK4)
Type:
Protein
Mol. Mass.:
64098.01
Organism:
Homo sapiens (Human)
Description:
O96013
Residue:
591
  
Inhibitor
Name:
BDBM50448771
Synonyms:
CHEMBL3128042
Type:
Small organic molecule
Emp. Form.:
C22H26N6O2
Mol. Mass.:
406.4808
SMILES:
COCCNc1nc2ccc(cc2n1-c1ccnc(N)n1)C#CC1(O)CCCCC1
: