Target
Eukaryotic translation initiation factor 2-alpha kinase 3
Ligand
BDBM50043285
Substrate
Meas. Tech.
ChEMBL_1444809 (CHEMBL3379052)
IC50
3.2±n/a nM
Citation
 Rosse, G Pyrrolopyridines-quinazolines Inhibitors of PKR-Like ER Kinase. ACS Med Chem Lett 6:21-2 (2015)  
Target
Name:
Eukaryotic translation initiation factor 2-alpha kinase 3
Synonyms:
E2AK3_HUMAN HsPEK PERK Pancreatic endoplasmic reticulum kinase (PERK)
Type:
Enzyme
Mol. Mass.:
125190.66
Organism:
Homo sapiens (Human)
Description:
Q9NZJ5
Residue:
1116
  
Inhibitor
Name:
BDBM50043285
Synonyms:
CHEMBL3355041
Type:
Small organic molecule
Emp. Form.:
C29H26FN5O3
Mol. Mass.:
511.5468
SMILES:
COc1cc2ncnc(Nc3ccc4N(CCc4c3)C(=O)Cn3c(C)cc4ccc(F)cc34)c2cc1OC
: