Target
Serine/threonine-protein kinase ATR
Ligand
BDBM50043408
Substrate
Meas. Tech.
ChEMBL_1444990 (CHEMBL3372398)
IC50
0.400000±n/a nM
Citation
 Barsanti, PAPan, YLu, YJain, RCox, MAversa, RJDillon, MPElling, RHu, CJin, XKnapp, MLan, JRamurthy, SRudewicz, PSetti, LSubramanian, SMathur, MTaricani, LThomas, GXiao, LYue, Q Structure-Based Drug Design of Novel, Potent, and Selective Azabenzimidazoles (ABI) as ATR Inhibitors. ACS Med Chem Lett 6:42-6 (2015)  
Target
Name:
Serine/threonine-protein kinase ATR
Synonyms:
ATR Ataxia telangiectasia and Rad3-related protein (ATR) FRP1 | Serine-protein kinase ATR
Type:
Protein
Mol. Mass.:
301404.58
Organism:
Homo sapiens (Human)
Description:
Q13535
Residue:
2644
  
Inhibitor
Name:
BDBM50043408
Synonyms:
CHEMBL3355475
Type:
Small organic molecule
Emp. Form.:
C19H20N6O
Mol. Mass.:
348.4017
SMILES:
C[C@@H]1COCCN1c1nc(cc2n(C)cnc12)-c1cncc2[nH]ccc12
: