Target
Serine/threonine-protein kinase/endoribonuclease IRE1
Ligand
BDBM50043776
Substrate
Meas. Tech.
ChEMBL_1445183 (CHEMBL3375435)
IC50
14±n/a nM
Citation
 Harrington, PEBiswas, KMalwitz, DTasker, ASMohr, CAndrews, KLDellamaggiore, KKendall, RBeckmann, HJaeckel, PMaterna-Reichelt, SAllen, JRLipford, JR Unfolded Protein Response in Cancer: IRE1a Inhibition by Selective Kinase Ligands Does Not Impair Tumor Cell Viability. ACS Med Chem Lett 6:68-72 (2015)  
Target
Name:
Serine/threonine-protein kinase/endoribonuclease IRE1
Synonyms:
ERN1 Endoplasmic reticulum-to-nucleus signaling 1 IRE1 Inositol requiring enzyme 1 (IRE-1alpha) Inositol-requiring protein 1 Ire1-alpha Serine/threonine-protein kinase/endoribonuclease IRE1 hIRE1p
Type:
Enzyme
Mol. Mass.:
109731.20
Organism:
Homo sapiens (Human)
Description:
O75460
Residue:
977
  
Inhibitor
Name:
BDBM50043776
Synonyms:
CHEMBL3355993
Type:
Small organic molecule
Emp. Form.:
C31H30N8O
Mol. Mass.:
530.6229
SMILES:
CN(C)CCNc1nccc(n1)-c1cccnc1Oc1c(C)cc(Nc2nc3ccccc3[nH]2)c2ccccc12
: