Target
LIM domain kinase 2
Ligand
BDBM50044016
Substrate
Meas. Tech.
ChEMBL_1445332 (CHEMBL3377887)
IC50
>1000±n/a nM
Citation
 Harrison, BAAlmstead, ZYBurgoon, HGardyan, MGoodwin, NCHealy, JLiu, YMabon, RMarinelli, BSamala, LZhang, YStouch, TRWhitlock, NAGopinathan, SMcKnight, BWang, SPatel, NWilson, AGHamman, BDRice, DSRawlins, DB Discovery and Development of LX7101, a Dual LIM-Kinase and ROCK Inhibitor for the Treatment of Glaucoma. ACS Med Chem Lett 6:84-8 (2015)  
Target
Name:
LIM domain kinase 2
Synonyms:
LIMK2 | LIMK2_HUMAN
Type:
PROTEIN
Mol. Mass.:
72238.81
Organism:
Homo sapiens (Human)
Description:
ChEMBL_1514398
Residue:
638
  
Inhibitor
Name:
BDBM50044016
Synonyms:
CHEMBL3356420
Type:
Small organic molecule
Emp. Form.:
C19H20N6O
Mol. Mass.:
348.4017
SMILES:
Cc1c[nH]c2ncnc(N3CCN4C(CN(C4=O)c4ccccc4)C3)c12
: