Target
Transient receptor potential cation channel subfamily M member 8
Ligand
BDBM50329104
Substrate
Meas. Tech.
ChEMBL_1452555 (CHEMBL3363422)
IC50
9000±n/a nM
Citation
 Terada, YKitajima, MTaguchi, FTakayama, HHorie, SWatanabe, T Identification of Indole Alkaloid Structural Units Important for Stimulus-Selective TRPM8 Inhibition: SAR Study of Naturally Occurring Iboga Derivatives. J Nat Prod 77:1831-8 (2014)  
Target
Name:
Transient receptor potential cation channel subfamily M member 8
Synonyms:
LTrpC-6 Ltrpc6 Transient receptor potential p8 Trpm8 | Trpp8
Type:
PROTEIN
Mol. Mass.:
127713.99
Organism:
Mus musculus
Description:
ChEMBL_107992
Residue:
1104
  
Inhibitor
Name:
BDBM50329104
Synonyms:
CHEMBL182120 voacangine
Type:
Small organic molecule
Emp. Form.:
C22H28N2O3
Mol. Mass.:
368.4693
SMILES:
CC[C@H]1C[C@@H]2CN3CCc4c([nH]c5ccc(OC)cc45)[C@](C2)([C@H]13)C(=O)OC
: