Target
11-beta-hydroxysteroid dehydrogenase 1
Ligand
BDBM50044113
Substrate
Meas. Tech.
ChEMBL_1453473 (CHEMBL3362160)
IC50
10000±n/a nM
Citation
 Wang, HNing, RShen, YChen, ZLi, JZhang, RLeng, YZhao, W Lithocarpic Acids A-N, 3,4-seco-Cycloartane Derivatives from the Cupules of Lithocarpus polystachyus. J Nat Prod 77:1910-20 (2014)  
Target
Name:
11-beta-hydroxysteroid dehydrogenase 1
Synonyms:
11-DH 11-beta-Hydroxysteroid Dehydrogenase 1 (11-beta-HSD1) 11-beta-hydroxysteroid dehydrogenase 1 (11HSD1) Corticosteroid 11-beta-dehydrogenase isozyme 1 (11-beta-HSD-1) Corticosteroid 11-beta-dehydrogenase isozyme 1 (11beta-HSD1) HSD11 HSD11L | SDR26C1
Type:
Enzyme
Mol. Mass.:
32409.16
Organism:
Homo sapiens (Human)
Description:
P28845
Residue:
292
  
Inhibitor
Name:
BDBM50044113
Synonyms:
CHEMBL3331554
Type:
Small organic molecule
Emp. Form.:
C32H50O5
Mol. Mass.:
514.7364
SMILES:
[H][C@@](COC(C)=O)(C\C=C\C(C)(C)O)[C@@]1([H])CC[C@@]2(C)[C@]3([H])CC[C@@H](C(C)=C)[C@@]4(CCC(O)=O)C[C@@]34CC[C@]12C
: