Target
Muscarinic acetylcholine receptor M4
Ligand
BDBM50044634
Substrate
Meas. Tech.
ChEMBL_1448350 (CHEMBL3376269)
EC50
47±n/a nM
Citation
 Takai, KInoue, YKonishi, YSuwa, AUruno, YMatsuda, HNakako, TSakai, MNishikawa, HHashimoto, GEnomoto, TKitamura, AUematsu, YKiyoshi, ASumiyoshi, T Discovery of N-substituted 7-azaindoline derivatives as potent, orally available M1 and M4 muscarinic acetylcholine receptors selective agonists. Bioorg Med Chem Lett 24:3189-93 (2014)  
Target
Name:
Muscarinic acetylcholine receptor M4
Synonyms:
ACM4_HUMAN Cholinergic, muscarinic M4 Muscarinic acetylcholine receptor M2 and M4
Type:
Enzyme Catalytic Domain
Mol. Mass.:
53079.31
Organism:
Homo sapiens (Human)
Description:
Cholinergic, muscarinic M4 CHRM4 HUMAN M3::P08173
Residue:
479
  
Inhibitor
Name:
BDBM50044634
Synonyms:
CHEMBL3310802
Type:
Small organic molecule
Emp. Form.:
C27H39N5O7
Mol. Mass.:
545.6279
SMILES:
OC(=O)\C=C\C(O)=O.CCOC(=O)N1CCC(CN2CCC3(CN(C(=O)N(C)C)c4ncccc34)CC2)CC1
: