Target
Serine/threonine-protein kinase PLK2
Ligand
BDBM50044657
Substrate
Meas. Tech.
ChEMBL_1450868 (CHEMBL3364627)
IC50
>100000±n/a nM
Citation
 Sampson, PBLiu, YPatel, NKFeher, MForrest, BLi, SWEdwards, LLaufer, RLang, YBan, FAwrey, DEMao, GPlotnikova, OLeung, GHodgson, RMason, JMWei, XKiarash, RGreen, EQiu, WChirgadze, NYMak, TWPan, GPauls, HW The discovery of Polo-like kinase 4 inhibitors: design and optimization of spiro[cyclopropane-1,3'[3H]indol]-2'(1'H).ones as orally bioavailable antitumor agents. J Med Chem 58:130-46 (2015)  
Target
Name:
Serine/threonine-protein kinase PLK2
Synonyms:
PLK2 Polo-Like Kinase 2 Serine/threonine-protein kinase PLK2 Serum-inducible kinase
Type:
Serine/threonine-protein kinase
Mol. Mass.:
78259.87
Organism:
Homo sapiens (Human)
Description:
Full-length human PLK2 was expressed as GST-fusion protein using baculovirus expression system. GST-PLK2 was purified by using glutathione sepharose chromatography.
Residue:
685
  
Inhibitor
Name:
BDBM50044657
Synonyms:
CHEMBL3353347 US9907800, Example A24
Type:
Small organic molecule
Emp. Form.:
C28H26N4O
Mol. Mass.:
434.5322
SMILES:
CN(C)Cc1ccc(\C=C\c2n[nH]c3cc(ccc23)[C@@H]2C[C@@]22C(=O)Nc3ccccc23)cc1
: