Target
Vasopressin V1b receptor
Ligand
BDBM50044728
Substrate
Meas. Tech.
ChEMBL_1451729 (CHEMBL3366922)
EC50
84±n/a nM
Citation
 Wisniewski, KAlagarsamy, SGalyean, RTariga, HThompson, DLy, BWisniewska, HQi, SCroston, GLaporte, RRivière, PJSchteingart, CD New, potent, and selective peptidic oxytocin receptor agonists. J Med Chem 57:5306-17 (2014)  
Target
Name:
Vasopressin V1b receptor
Synonyms:
AVPR V1b AVPR1B Antidiuretic hormone receptor 1b V1bR VPR3 Vasopressin V1b receptor (V1b) Vasopressin V3 receptor
Type:
Enzyme
Mol. Mass.:
46985.01
Organism:
Homo sapiens (Human)
Description:
P47901
Residue:
424
  
Inhibitor
Name:
BDBM50044728
Synonyms:
CHEMBL3354591
Type:
Small organic molecule
Emp. Form.:
C49H71N11O12S
Mol. Mass.:
1038.22
SMILES:
[H][C@]1(NC(=O)[C@H](Cc2ccc(O)cc2)NC(=O)CCCSC[C@H](NC(=O)[C@H](CC(N)=O)NC(=O)[C@H](CCC(N)=O)NC1=O)C(=O)N(CC(=O)N[C@@H](CC(C)C)C(=O)NCC(N)=O)Cc1cccc(C)c1)[C@@H](C)CC
: