Target
Cathepsin H
Ligand
BDBM50045442
Substrate
Meas. Tech.
ChEMBL_1459864 (CHEMBL3367287)
IC50
9000±n/a nM
Citation
 Raghav, NSingh, M SAR studies of differently functionalized chalcones based hydrazones and their cyclized derivatives as inhibitors of mammalian cathepsin B and cathepsin H. Bioorg Med Chem 22:4233-45 (2014)  
Target
Name:
Cathepsin H
Synonyms:
Type:
Protein
Mol. Mass.:
37394.24
Organism:
Capra hircus (Goat)
Description:
A0A060INS8
Residue:
335
  
Inhibitor
Name:
BDBM50045442
Synonyms:
CHEMBL332286
Type:
Small organic molecule
Emp. Form.:
C17H15ClN2O
Mol. Mass.:
298.767
SMILES:
CC(=O)N1N=C(CC1c1ccc(Cl)cc1)c1ccccc1
: