Target
NPC1-like intracellular cholesterol transporter 1
Ligand
BDBM50045540
Substrate
Meas. Tech.
ChEMBL_1451836 (CHEMBL3362445)
EC50
1700±n/a nM
Citation
 Ohgane, KKaraki, FNoguchi-Yachide, TDodo, KHashimoto, Y Structure-activity relationships of oxysterol-derived pharmacological chaperones for Niemann-Pick type C1 protein. Bioorg Med Chem Lett 24:3480-5 (2014)  
Target
Name:
NPC1-like intracellular cholesterol transporter 1
Synonyms:
NPC1L1 Niemann-Pick C1-like protein 1
Type:
PROTEIN
Mol. Mass.:
148724.10
Organism:
Homo sapiens (Human)
Description:
ChEMBL_1451836
Residue:
1359
  
Inhibitor
Name:
BDBM50045540
Synonyms:
CHEMBL3311217
Type:
Small organic molecule
Emp. Form.:
C27H48O4
Mol. Mass.:
436.6676
SMILES:
[H][C@@]1(CC[C@@]2([H])[C@]3([H])C[C@@H](O)[C@@]4(O)C[C@@H](O)CC[C@]4(C)[C@@]3([H])CC[C@]12C)[C@H](C)CCCC(C)(C)O
: