Target
Glycogen synthase kinase-3 beta
Ligand
BDBM2579
Substrate
Meas. Tech.
ChEMBL_1449342 (CHEMBL3372070)
IC50
33±n/a nM
Citation
 Lu, JMaezawa, IWeerasekara, SErenler, RNguyen, TDNguyen, JSwisher, LZLi, JJin, LWRanjan, ASrivastava, SKHua, DH Syntheses, neural protective activities, and inhibition of glycogen synthase kinase-3ß of substituted quinolines. Bioorg Med Chem Lett 24:3392-7 (2014)  
Target
Name:
Glycogen synthase kinase-3 beta
Synonyms:
GSK-3 beta GSK3B Glycogen synthase kinase 3 beta (GSK3B) Glycogen synthase kinase-3 beta (GSK-3B) Glycogen synthase kinase-3 beta (GSK3B) Glycogen synthase kinase-3beta (GSK3B) | Serine/threonine-protein kinase GSK3B
Type:
Enzyme
Mol. Mass.:
46756.38
Organism:
Homo sapiens (Human)
Description:
P49841
Residue:
420
  
Inhibitor
Name:
BDBM2579
Synonyms:
(2S,3R,4R,6R)-3-methoxy-2-methyl-4-(methylamino)-29-oxa-1,7,17-triazaoctacyclo[12.12.2.1^{2,6}.0^{7,28}.0^{8,13}.0^{15,19}.0^{20,27}.0^{21,26}]nonacosa-8(13),9,11,14(28),15(19),20(27),21(26),22,24-nonaen-16-one Staurosporin, 4 Staurosporine, 8 US9206188, Staurosporine | US9226923, Staurosporine
Type:
Small organic molecule
Emp. Form.:
C28H26N4O3
Mol. Mass.:
466.531
SMILES:
CN[C@@H]1C[C@H]2O[C@@](C)([C@@H]1OC)n1c3ccccc3c3c4CNC(=O)c4c4c5ccccc5n2c4c13
: