Target
Glutamate carboxypeptidase 2
Ligand
BDBM50046832
Substrate
Meas. Tech.
ChEMBL_1453676 (CHEMBL3363782)
Ki
0.044900±n/a nM
Citation
 Tykvart, JSchimer, JBarinková, JPachl, PPo?tová-Slavetínská, LMajer, PKonvalinka, J?ácha, P Rational design of urea-based glutamate carboxypeptidase II (GCPII) inhibitors as versatile tools for specific drug targeting and delivery. Bioorg Med Chem 22:4099-108 (2014)  
Target
Name:
Glutamate carboxypeptidase 2
Synonyms:
FGCP FOLH1 Folate hydrolase 1 Glutamate carboxypeptidase 2 Membrane glutamate carboxypeptidase NAALAD1 PSM Prostate-specific membrane antigen mGCP
Type:
PROTEIN
Mol. Mass.:
84333.66
Organism:
Homo sapiens (Human)
Description:
ChEMBL_1497035
Residue:
750
  
Inhibitor
Name:
BDBM50046832
Synonyms:
CHEMBL3309678
Type:
Small organic molecule
Emp. Form.:
C21H28BrN3O8
Mol. Mass.:
530.366
SMILES:
CC(=O)N(CCCC[C@H](NC(=O)N[C@@H](CCC(O)=O)C(O)=O)C(O)=O)Cc1ccc(Br)cc1
: