Target
Amine oxidase [flavin-containing] A
Ligand
BDBM50046862
Substrate
Meas. Tech.
ChEMBL_1453690 (CHEMBL3364092)
IC50
>10000±n/a nM
Citation
 Tzvetkov, NTHinz, SKüppers, PGastreich, MMüller, CE Indazole- and indole-5-carboxamides: selective and reversible monoamine oxidase B inhibitors with subnanomolar potency. J Med Chem 57:6679-703 (2014)  
Target
Name:
Amine oxidase [flavin-containing] A
Synonyms:
AOFA_HUMAN MAO-A Monoamine oxidase Monoamine oxidase type A (MAO A) Monoamine oxidase type A (MAOA)
Type:
Protein
Mol. Mass.:
59689.53
Organism:
Homo sapiens (Human)
Description:
P21397
Residue:
527
  
Inhibitor
Name:
BDBM50046862
Synonyms:
CHEMBL3319259
Type:
Small organic molecule
Emp. Form.:
C14H9Cl2N3O
Mol. Mass.:
306.147
SMILES:
Clc1cc(Cl)cc(NC(=O)c2ccc3cn[nH]c3c2)c1
: