Target
Amine oxidase [flavin-containing] A
Ligand
BDBM50046876
Substrate
Meas. Tech.
ChEMBL_1453690 (CHEMBL3364092)
IC50
>10000±n/a nM
Citation
 Tzvetkov, NTHinz, SKüppers, PGastreich, MMüller, CE Indazole- and indole-5-carboxamides: selective and reversible monoamine oxidase B inhibitors with subnanomolar potency. J Med Chem 57:6679-703 (2014)  
Target
Name:
Amine oxidase [flavin-containing] A
Synonyms:
AOFA_HUMAN MAO-A Monoamine oxidase Monoamine oxidase type A (MAO A) Monoamine oxidase type A (MAOA)
Type:
Protein
Mol. Mass.:
59689.53
Organism:
Homo sapiens (Human)
Description:
P21397
Residue:
527
  
Inhibitor
Name:
BDBM50046876
Synonyms:
CHEMBL3319249
Type:
Small organic molecule
Emp. Form.:
C16H15N3O3
Mol. Mass.:
297.3086
SMILES:
COc1ccc(NC(=O)c2ccc3[nH]ncc3c2)cc1OC
: