Target
Amine oxidase [flavin-containing] A
Ligand
BDBM50046879
Substrate
Meas. Tech.
ChEMBL_1453690 (CHEMBL3364092)
IC50
>10000±n/a nM
Citation
 Tzvetkov, NTHinz, SKüppers, PGastreich, MMüller, CE Indazole- and indole-5-carboxamides: selective and reversible monoamine oxidase B inhibitors with subnanomolar potency. J Med Chem 57:6679-703 (2014)  
Target
Name:
Amine oxidase [flavin-containing] A
Synonyms:
AOFA_HUMAN MAO-A Monoamine oxidase Monoamine oxidase type A (MAO A) Monoamine oxidase type A (MAOA)
Type:
Protein
Mol. Mass.:
59689.53
Organism:
Homo sapiens (Human)
Description:
P21397
Residue:
527
  
Inhibitor
Name:
BDBM50046879
Synonyms:
CHEMBL3317469
Type:
Small organic molecule
Emp. Form.:
C14H9ClFN3O
Mol. Mass.:
289.692
SMILES:
Fc1ccc(NC(=O)c2ccc3[nH]ncc3c2)cc1Cl
: