Target
Amine oxidase [flavin-containing] B
Ligand
BDBM50046875
Substrate
Meas. Tech.
ChEMBL_1453693 (CHEMBL3364095)
IC50
22±n/a nM
Citation
 Tzvetkov, NTHinz, SKüppers, PGastreich, MMüller, CE Indazole- and indole-5-carboxamides: selective and reversible monoamine oxidase B inhibitors with subnanomolar potency. J Med Chem 57:6679-703 (2014)  
Target
Name:
Amine oxidase [flavin-containing] B
Synonyms:
AOFB_RAT Amine oxidase [flavin-containing] B Monoamine Oxidase Type B (MAO-B) Monoamine oxidase B (MAO-B) Monoamine oxidase type B (MAOB) | Monoamine oxidase-B (MAO-B)
Type:
Enzyme
Mol. Mass.:
58469.65
Organism:
Rattus norvegicus (rat)
Description:
P19643
Residue:
520
  
Inhibitor
Name:
BDBM50046875
Synonyms:
CHEMBL3319250
Type:
Small organic molecule
Emp. Form.:
C15H12ClN3O2
Mol. Mass.:
301.728
SMILES:
COc1ccc(NC(=O)c2ccc3[nH]ncc3c2)cc1Cl
: