Target
Amine oxidase [flavin-containing] B
Ligand
BDBM50046945
Substrate
Meas. Tech.
ChEMBL_1453692 (CHEMBL3364094)
IC50
141±n/a nM
Citation
 Tzvetkov, NTHinz, SKüppers, PGastreich, MMüller, CE Indazole- and indole-5-carboxamides: selective and reversible monoamine oxidase B inhibitors with subnanomolar potency. J Med Chem 57:6679-703 (2014)  
Target
Name:
Amine oxidase [flavin-containing] B
Synonyms:
AOFB_HUMAN MAOB Monoamine oxidase type B (MAO B) Monoamine oxidase type B (MAOB)
Type:
Protein
Mol. Mass.:
58768.76
Organism:
Homo sapiens (Human)
Description:
P27338
Residue:
520
  
Inhibitor
Name:
BDBM50046945
Synonyms:
CHEMBL3319270
Type:
Small organic molecule
Emp. Form.:
C14H9Cl2N3O
Mol. Mass.:
306.147
SMILES:
Clc1ccc(NC(=O)c2ccc3nccn3c2)cc1Cl
: