Target
Amine oxidase [flavin-containing] B
Ligand
BDBM50046852
Substrate
Meas. Tech.
ChEMBL_1453692 (CHEMBL3364094)
IC50
<10000±n/a nM
Citation
 Tzvetkov, NTHinz, SKüppers, PGastreich, MMüller, CE Indazole- and indole-5-carboxamides: selective and reversible monoamine oxidase B inhibitors with subnanomolar potency. J Med Chem 57:6679-703 (2014)  
Target
Name:
Amine oxidase [flavin-containing] B
Synonyms:
AOFB_HUMAN MAOB Monoamine oxidase type B (MAO B) Monoamine oxidase type B (MAOB)
Type:
Protein
Mol. Mass.:
58768.76
Organism:
Homo sapiens (Human)
Description:
P27338
Residue:
520
  
Inhibitor
Name:
BDBM50046852
Synonyms:
CHEMBL3319265
Type:
Small organic molecule
Emp. Form.:
C14H10ClN3O2
Mol. Mass.:
287.701
SMILES:
Oc1ccc(NC(=O)c2ccc3cn[nH]c3c2)cc1Cl
: