Target
Amine oxidase [flavin-containing] B
Ligand
BDBM50046937
Substrate
Meas. Tech.
ChEMBL_1453692 (CHEMBL3364094)
IC50
220±n/a nM
Citation
 Tzvetkov, NTHinz, SKüppers, PGastreich, MMüller, CE Indazole- and indole-5-carboxamides: selective and reversible monoamine oxidase B inhibitors with subnanomolar potency. J Med Chem 57:6679-703 (2014)  
Target
Name:
Amine oxidase [flavin-containing] B
Synonyms:
AOFB_HUMAN MAOB Monoamine oxidase type B (MAO B) Monoamine oxidase type B (MAOB)
Type:
Protein
Mol. Mass.:
58768.76
Organism:
Homo sapiens (Human)
Description:
P27338
Residue:
520
  
Inhibitor
Name:
BDBM50046937
Synonyms:
CHEMBL3319238
Type:
Small organic molecule
Emp. Form.:
C17H16ClN5O2
Mol. Mass.:
357.794
SMILES:
Clc1cc(cnc1N1CCOCC1)C(=O)Nc1ccc2cn[nH]c2c1
: