Target
Amine oxidase [flavin-containing] A
Ligand
BDBM50046883
Substrate
Meas. Tech.
ChEMBL_1453691 (CHEMBL3364093)
IC50
>10000±n/a nM
Citation
 Tzvetkov, NTHinz, SKüppers, PGastreich, MMüller, CE Indazole- and indole-5-carboxamides: selective and reversible monoamine oxidase B inhibitors with subnanomolar potency. J Med Chem 57:6679-703 (2014)  
Target
Name:
Amine oxidase [flavin-containing] A
Synonyms:
AOFA_RAT Amine oxidase [flavin-containing] A Monoamine Oxidase Type A (MAO-A) Monoamine oxidase A (MAO-A) Monoamine oxidase type A (MAOA)
Type:
Enzyme
Mol. Mass.:
59515.21
Organism:
Rattus norvegicus (rat)
Description:
Residue:
526
  
Inhibitor
Name:
BDBM50046883
Synonyms:
CHEMBL3319242
Type:
Small organic molecule
Emp. Form.:
C14H9Cl2N3O
Mol. Mass.:
306.147
SMILES:
Clc1ccc(cc1Cl)C(=O)Nc1ccc2[nH]ncc2c1
: