Target
Amine oxidase [flavin-containing] A
Ligand
BDBM50046944
Substrate
Meas. Tech.
ChEMBL_1453690 (CHEMBL3364092)
IC50
>10000±n/a nM
Citation
 Tzvetkov, NTHinz, SKüppers, PGastreich, MMüller, CE Indazole- and indole-5-carboxamides: selective and reversible monoamine oxidase B inhibitors with subnanomolar potency. J Med Chem 57:6679-703 (2014)  
Target
Name:
Amine oxidase [flavin-containing] A
Synonyms:
AOFA_HUMAN MAO-A Monoamine oxidase Monoamine oxidase type A (MAO A) Monoamine oxidase type A (MAOA)
Type:
Protein
Mol. Mass.:
59689.53
Organism:
Homo sapiens (Human)
Description:
P21397
Residue:
527
  
Inhibitor
Name:
BDBM50046944
Synonyms:
CHEMBL3319269
Type:
Small organic molecule
Emp. Form.:
C16H12Cl2N2O
Mol. Mass.:
319.185
SMILES:
Cn1ccc2cc(ccc12)C(=O)Nc1ccc(Cl)c(Cl)c1
: