Target
ATP-binding cassette sub-family C member 2
Ligand
BDBM50047213
Substrate
Meas. Tech.
ChEMBL_1455461 (CHEMBL3363893)
EC50
>200000±n/a nM
Citation
 Basarab, GSHill, PJGarner, CEHull, KGreen, OSherer, BADangel, PBManchester, JIBist, SHauck, SZhou, FUria-Nickelsen, MIllingworth, RAlm, RRooney, MEakin, AE Optimization of pyrrolamide topoisomerase II inhibitors toward identification of an antibacterial clinical candidate (AZD5099). J Med Chem 57:6060-82 (2014)  
Target
Name:
ATP-binding cassette sub-family C member 2
Synonyms:
ABCC2 CMOAT CMRP Canalicular multispecific organic anion transporter 1 MRP2 Multidrug resistance-associated protein 2 Multidrug resistance-associated protein 3 (MRP3)
Type:
Protein
Mol. Mass.:
174229.45
Organism:
Homo sapiens (Human)
Description:
Q92887
Residue:
1545
  
Inhibitor
Name:
BDBM50047213
Synonyms:
CHEMBL3314565
Type:
Small organic molecule
Emp. Form.:
C21H27Cl2N5O6S
Mol. Mass.:
548.44
SMILES:
COC[C@H](C)NC(=O)c1nc(sc1C(O)=O)N1CC[C@@H](NC(=O)c2[nH]c(C)c(Cl)c2Cl)[C@H](C1)OC
: