Target
Lysosomal alpha-glucosidase
Ligand
BDBM50333455
Substrate
Meas. Tech.
ChEMBL_1453753 (CHEMBL3364468)
IC50
130±n/a nM
Citation
 Natori, YSakuma, TYoshimura, YKinami, KHirokami, YSato, KAdachi, IKato, ATakahata, H Synthesis and biological evaluation ofa-1-C-4'-arylbutyl-L-arabinoiminofuranoses, a new class ofa-glucosidase inhibitors. Bioorg Med Chem Lett 24:3298-301 (2014)  
Target
Name:
Lysosomal alpha-glucosidase
Synonyms:
Acidic alpha-glucosidase LYAG_RAT
Type:
PROTEIN
Mol. Mass.:
106191.24
Organism:
Rattus norvegicus
Description:
ChEMBL_1506157
Residue:
953
  
Inhibitor
Name:
BDBM50333455
Synonyms:
(2S,3S,4S,5S)-2-butyl-5-(hydroxymethyl)pyrrolidine-3,4-diol | CHEMBL1641739
Type:
Small organic molecule
Emp. Form.:
C9H19NO3
Mol. Mass.:
189.2521
SMILES:
CCCC[C@@H]1N[C@@H](CO)[C@H](O)[C@H]1O
: