Target
Heat shock protein HSP 90-beta
Ligand
BDBM50048375
Substrate
Meas. Tech.
ChEMBL_1446734 (CHEMBL3381049)
Ki
179±n/a nM
Citation
 Casale, EAmboldi, NBrasca, MGCaronni, DColombo, NDalvit, CFelder, ERFogliatto, GGalvani, AIsacchi, APolucci, PRiceputi, LSola, FVisco, CZuccotto, FCasuscelli, F Fragment-based hit discovery and structure-based optimization of aminotriazoloquinazolines as novel Hsp90 inhibitors. Bioorg Med Chem 22:4135-50 (2014)  
Target
Name:
Heat shock protein HSP 90-beta
Synonyms:
HS90B_HUMAN HSP 90 HSP90B HSPCB Heat shock protein HSP 90 (Hsp90)
Type:
Molecular Chaperone
Mol. Mass.:
83229.45
Organism:
Homo sapiens (Human)
Description:
P08238
Residue:
724
  
Inhibitor
Name:
BDBM50048375
Synonyms:
CHEMBL3310152
Type:
Small organic molecule
Emp. Form.:
C19H17FN6O3
Mol. Mass.:
396.3751
SMILES:
Nc1nc2c3c(NCCO)cc(F)cc3nc(Cc3ccc4OCOc4c3)n2n1
: