Target
Amine oxidase [flavin-containing] A
Ligand
BDBM50048603
Substrate
Meas. Tech.
ChEMBL_1448561 (CHEMBL3379837)
Ki
12±n/a nM
Citation
 Evranos-Aksöz, BYabanoglu-Çiftçi, SUçar, GYelekçi, KErtan, R Synthesis of some novel hydrazone and 2-pyrazoline derivatives: monoamine oxidase inhibitory activities and docking studies. Bioorg Med Chem Lett 24:3278-84 (2014)  
Target
Name:
Amine oxidase [flavin-containing] A
Synonyms:
AOFA_HUMAN MAO-A Monoamine oxidase Monoamine oxidase type A (MAO A) Monoamine oxidase type A (MAOA)
Type:
Protein
Mol. Mass.:
59689.53
Organism:
Homo sapiens (Human)
Description:
P21397
Residue:
527
  
Inhibitor
Name:
BDBM50048603
Synonyms:
CHEMBL3310024
Type:
Small organic molecule
Emp. Form.:
C20H17ClN4OS
Mol. Mass.:
396.893
SMILES:
Cc1nnsc1C(=O)N\N=C(\C=C\c1ccc(C)cc1)/c1ccc(Cl)cc1
: