Target
Aryl hydrocarbon receptor
Ligand
BDBM50049057
Substrate
Meas. Tech.
ChEMBL_1453812 (CHEMBL3365189)
EC50
86±n/a nM
Citation
 Winston-McPherson, GNShu, DTang, W Synthesis and biological evaluation of 2,3'-diindolylmethanes as agonists of aryl hydrocarbon receptor. Bioorg Med Chem Lett 24:4023-5 (2014)  
Target
Name:
Aryl hydrocarbon receptor
Synonyms:
AHR BHLHE76 aryl hydrocarbon receptor precursor
Type:
PROTEIN
Mol. Mass.:
96143.77
Organism:
Homo sapiens (Human)
Description:
ChEMBL_1503828
Residue:
848
  
Inhibitor
Name:
BDBM50049057
Synonyms:
CHEMBL3319505 US9969686, Compound 10d
Type:
Small organic molecule
Emp. Form.:
C18H16N2
Mol. Mass.:
260.333
SMILES:
Cn1cc(Cc2cc3ccccc3[nH]2)c2ccccc12
: