Target
Aryl hydrocarbon receptor
Ligand
BDBM50049065
Substrate
Meas. Tech.
ChEMBL_1453812 (CHEMBL3365189)
EC50
270±n/a nM
Citation
 Winston-McPherson, GNShu, DTang, W Synthesis and biological evaluation of 2,3'-diindolylmethanes as agonists of aryl hydrocarbon receptor. Bioorg Med Chem Lett 24:4023-5 (2014)  
Target
Name:
Aryl hydrocarbon receptor
Synonyms:
AHR BHLHE76 aryl hydrocarbon receptor precursor
Type:
PROTEIN
Mol. Mass.:
96143.77
Organism:
Homo sapiens (Human)
Description:
ChEMBL_1503828
Residue:
848
  
Inhibitor
Name:
BDBM50049065
Synonyms:
CHEMBL3319497 US9969686, Compound 6
Type:
Small organic molecule
Emp. Form.:
C18H14N2O
Mol. Mass.:
274.3166
SMILES:
O=Cc1c(Cc2c[nH]c3ccccc23)[nH]c2ccccc12
: