Target
Acetylcholinesterase
Ligand
BDBM8987
Substrate
Meas. Tech.
ChEMBL_1454788 (CHEMBL3363249)
IC50
5.9±n/a nM
Citation
 Di Pietro, OPérez-Areales, FJJuárez-Jiménez, JEspargaró, AClos, MVPérez, BLavilla, RSabaté, RLuque, FJMuñoz-Torrero, D Tetrahydrobenzo[h][1,6]naphthyridine-6-chlorotacrine hybrids as a new family of anti-Alzheimer agents targetingß-amyloid, tau, and cholinesterase pathologies. Eur J Med Chem 84:107-17 (2014)  
Target
Name:
Acetylcholinesterase
Synonyms:
ACES_HUMAN Acetylcholinesterase (AChE) | Acetylcholinesterase (human AChE)
Type:
Enzyme
Mol. Mass.:
67792.70
Organism:
Homo sapiens (Human)
Description:
P22303
Residue:
614
  
Inhibitor
Name:
BDBM8987
Synonyms:
6-chloro-1,2,3,4-tetrahydroacridin-9-amine 6-chlorotacrine.HCl Tacrine Analogue 4
Type:
Small organic molecule
Emp. Form.:
C13H13ClN2
Mol. Mass.:
232.709
SMILES:
Nc1c2CCCCc2nc2cc(Cl)ccc12
: